[Zope-tests] FAILED (failures=1, errors=10): Test Zope 2 HEAD / Python 2.3 / Linux

jeremy at zope.com jeremy at zope.com
Fri Jan 30 05:36:28 EST 2004


Email automatically generated by a daily test runner.

cd /tmp/autotestd64qFm/Zope
PYTHONPATH=/tmp/autotestd64qFm/lib/python  /usr/local/bin/python2.3 -u test.py -v --all
Running unit tests at all levels
Running unit tests from /tmp/autotestd64qFm/Zope
.............................................................................................................................................................................................................................................................................................................................................................................................................................................................................................................................................................................................................................................................................................................................................................................................................................................................................................................................................................................................................................!
............................................................................................................................................................................................................................................................................................................................................

Error in test testAutoReqPopulate (Products.Sessions.tests.testSessionDataManager.TestSessionManager)
Traceback (most recent call last):
  File "/tmp/autotestd64qFm/Zope/lib/python/Products/Sessions/tests/testSessionDataManager.py", line 217, in testAutoReqPopulate
    self.app.REQUEST.traverse('/')
  File "/tmp/autotestd64qFm/Zope/lib/python/ZPublisher/BaseRequest.py", line 426, in traverse
    else: user=v(request, auth, roles)
  File "/tmp/autotestd64qFm/Zope/lib/python/AccessControl/User.py", line 647, in validate
    if self._isTop() and self.authorize(self._nobody, a,c,n,v,roles):
  File "/tmp/autotestd64qFm/Zope/lib/python/AccessControl/User.py", line 595, in authorize
    if security.validate(accessed, container, name, value, roles):
TypeError: iterable argument required

...............

Error in test testUnlazifyAutoPopulated (Products.Sessions.tests.testSessionDataManager.TestSessionManager)
Traceback (most recent call last):
  File "/tmp/autotestd64qFm/Zope/lib/python/Products/Sessions/tests/testSessionDataManager.py", line 223, in testUnlazifyAutoPopulated
    self.app.REQUEST.traverse('/')
  File "/tmp/autotestd64qFm/Zope/lib/python/ZPublisher/BaseRequest.py", line 426, in traverse
    else: user=v(request, auth, roles)
  File "/tmp/autotestd64qFm/Zope/lib/python/AccessControl/User.py", line 647, in validate
    if self._isTop() and self.authorize(self._nobody, a,c,n,v,roles):
  File "/tmp/autotestd64qFm/Zope/lib/python/AccessControl/User.py", line 595, in authorize
    if security.validate(accessed, container, name, value, roles):
TypeError: iterable argument required

...

Error in test testTraverse0 (Products.SiteAccess.tests.testVirtualHostMonster.VHMRegressions)
Traceback (most recent call last):
  File "/tmp/autotestd64qFm/Zope/lib/python/Products/SiteAccess/tests/testVirtualHostMonster.py", line 77, in test
    ob = self.traverse('%s/%s/' % (vaddr, p))
  File "/tmp/autotestd64qFm/Zope/lib/python/ZPublisher/BaseRequest.py", line 426, in traverse
    else: user=v(request, auth, roles)
  File "/tmp/autotestd64qFm/Zope/lib/python/AccessControl/User.py", line 647, in validate
    if self._isTop() and self.authorize(self._nobody, a,c,n,v,roles):
  File "/tmp/autotestd64qFm/Zope/lib/python/AccessControl/User.py", line 595, in authorize
    if security.validate(accessed, container, name, value, roles):
TypeError: iterable argument required



Error in test testTraverse1 (Products.SiteAccess.tests.testVirtualHostMonster.VHMRegressions)
Traceback (most recent call last):
  File "/tmp/autotestd64qFm/Zope/lib/python/Products/SiteAccess/tests/testVirtualHostMonster.py", line 77, in test
    ob = self.traverse('%s/%s/' % (vaddr, p))
  File "/tmp/autotestd64qFm/Zope/lib/python/ZPublisher/BaseRequest.py", line 426, in traverse
    else: user=v(request, auth, roles)
  File "/tmp/autotestd64qFm/Zope/lib/python/AccessControl/User.py", line 647, in validate
    if self._isTop() and self.authorize(self._nobody, a,c,n,v,roles):
  File "/tmp/autotestd64qFm/Zope/lib/python/AccessControl/User.py", line 595, in authorize
    if security.validate(accessed, container, name, value, roles):
TypeError: iterable argument required



Error in test testTraverse2 (Products.SiteAccess.tests.testVirtualHostMonster.VHMRegressions)
Traceback (most recent call last):
  File "/tmp/autotestd64qFm/Zope/lib/python/Products/SiteAccess/tests/testVirtualHostMonster.py", line 77, in test
    ob = self.traverse('%s/%s/' % (vaddr, p))
  File "/tmp/autotestd64qFm/Zope/lib/python/ZPublisher/BaseRequest.py", line 426, in traverse
    else: user=v(request, auth, roles)
  File "/tmp/autotestd64qFm/Zope/lib/python/AccessControl/User.py", line 647, in validate
    if self._isTop() and self.authorize(self._nobody, a,c,n,v,roles):
  File "/tmp/autotestd64qFm/Zope/lib/python/AccessControl/User.py", line 595, in authorize
    if security.validate(accessed, container, name, value, roles):
TypeError: iterable argument required



Error in test testTraverse3 (Products.SiteAccess.tests.testVirtualHostMonster.VHMRegressions)
Traceback (most recent call last):
  File "/tmp/autotestd64qFm/Zope/lib/python/Products/SiteAccess/tests/testVirtualHostMonster.py", line 77, in test
    ob = self.traverse('%s/%s/' % (vaddr, p))
  File "/tmp/autotestd64qFm/Zope/lib/python/ZPublisher/BaseRequest.py", line 426, in traverse
    else: user=v(request, auth, roles)
  File "/tmp/autotestd64qFm/Zope/lib/python/AccessControl/User.py", line 647, in validate
    if self._isTop() and self.authorize(self._nobody, a,c,n,v,roles):
  File "/tmp/autotestd64qFm/Zope/lib/python/AccessControl/User.py", line 595, in authorize
    if security.validate(accessed, container, name, value, roles):
TypeError: iterable argument required



Error in test testTraverse4 (Products.SiteAccess.tests.testVirtualHostMonster.VHMRegressions)
Traceback (most recent call last):
  File "/tmp/autotestd64qFm/Zope/lib/python/Products/SiteAccess/tests/testVirtualHostMonster.py", line 77, in test
    ob = self.traverse('%s/%s/' % (vaddr, p))
  File "/tmp/autotestd64qFm/Zope/lib/python/ZPublisher/BaseRequest.py", line 426, in traverse
    else: user=v(request, auth, roles)
  File "/tmp/autotestd64qFm/Zope/lib/python/AccessControl/User.py", line 647, in validate
    if self._isTop() and self.authorize(self._nobody, a,c,n,v,roles):
  File "/tmp/autotestd64qFm/Zope/lib/python/AccessControl/User.py", line 595, in authorize
    if security.validate(accessed, container, name, value, roles):
TypeError: iterable argument required



Error in test testTraverse5 (Products.SiteAccess.tests.testVirtualHostMonster.VHMRegressions)
Traceback (most recent call last):
  File "/tmp/autotestd64qFm/Zope/lib/python/Products/SiteAccess/tests/testVirtualHostMonster.py", line 77, in test
    ob = self.traverse('%s/%s/' % (vaddr, p))
  File "/tmp/autotestd64qFm/Zope/lib/python/ZPublisher/BaseRequest.py", line 426, in traverse
    else: user=v(request, auth, roles)
  File "/tmp/autotestd64qFm/Zope/lib/python/AccessControl/User.py", line 647, in validate
    if self._isTop() and self.authorize(self._nobody, a,c,n,v,roles):
  File "/tmp/autotestd64qFm/Zope/lib/python/AccessControl/User.py", line 595, in authorize
    if security.validate(accessed, container, name, value, roles):
TypeError: iterable argument required



Error in test testTraverse6 (Products.SiteAccess.tests.testVirtualHostMonster.VHMRegressions)
Traceback (most recent call last):
  File "/tmp/autotestd64qFm/Zope/lib/python/Products/SiteAccess/tests/testVirtualHostMonster.py", line 77, in test
    ob = self.traverse('%s/%s/' % (vaddr, p))
  File "/tmp/autotestd64qFm/Zope/lib/python/ZPublisher/BaseRequest.py", line 426, in traverse
    else: user=v(request, auth, roles)
  File "/tmp/autotestd64qFm/Zope/lib/python/AccessControl/User.py", line 647, in validate
    if self._isTop() and self.authorize(self._nobody, a,c,n,v,roles):
  File "/tmp/autotestd64qFm/Zope/lib/python/AccessControl/User.py", line 595, in authorize
    if security.validate(accessed, container, name, value, roles):
TypeError: iterable argument required



Error in test testTraverse7 (Products.SiteAccess.tests.testVirtualHostMonster.VHMRegressions)
Traceback (most recent call last):
  File "/tmp/autotestd64qFm/Zope/lib/python/Products/SiteAccess/tests/testVirtualHostMonster.py", line 77, in test
    ob = self.traverse('%s/%s/' % (vaddr, p))
  File "/tmp/autotestd64qFm/Zope/lib/python/ZPublisher/BaseRequest.py", line 426, in traverse
    else: user=v(request, auth, roles)
  File "/tmp/autotestd64qFm/Zope/lib/python/AccessControl/User.py", line 647, in validate
    if self._isTop() and self.authorize(self._nobody, a,c,n,v,roles):
  File "/tmp/autotestd64qFm/Zope/lib/python/AccessControl/User.py", line 595, in authorize
    if security.validate(accessed, container, name, value, roles):
TypeError: iterable argument required

.............................................................................................................................................................................................................................................................................................................................................................................................................................................................................................................................................................................................................................................................................................................................................................................................................................................................................................................................................................................................................................!
....................................................................................................................................................................................................................................................................................................................................................................................................................................

Failure in test testInitializeSecurityOptions (Zope.Startup.tests.testStarter.ZopeStarterTestCase)
Traceback (most recent call last):
  File "/tmp/autotestd64qFm/Zope/lib/python/Zope/Startup/tests/testStarter.py", line 378, in testInitializeSecurityOptions
    self.assertEqual(Implementation.getImplementationName(), "PYTHON")
  File "/usr/local/lib/python2.3/unittest.py", line 302, in failUnlessEqual
    raise self.failureException, \
AssertionError: 'C' != 'PYTHON'

...................................................................................................................
======================================================================
ERROR: testAutoReqPopulate (Products.Sessions.tests.testSessionDataManager.TestSessionManager)
----------------------------------------------------------------------
Traceback (most recent call last):
  File "/tmp/autotestd64qFm/Zope/lib/python/Products/Sessions/tests/testSessionDataManager.py", line 217, in testAutoReqPopulate
    self.app.REQUEST.traverse('/')
  File "/tmp/autotestd64qFm/Zope/lib/python/ZPublisher/BaseRequest.py", line 426, in traverse
    else: user=v(request, auth, roles)
  File "/tmp/autotestd64qFm/Zope/lib/python/AccessControl/User.py", line 647, in validate
    if self._isTop() and self.authorize(self._nobody, a,c,n,v,roles):
  File "/tmp/autotestd64qFm/Zope/lib/python/AccessControl/User.py", line 595, in authorize
    if security.validate(accessed, container, name, value, roles):
TypeError: iterable argument required

======================================================================
ERROR: testUnlazifyAutoPopulated (Products.Sessions.tests.testSessionDataManager.TestSessionManager)
----------------------------------------------------------------------
Traceback (most recent call last):
  File "/tmp/autotestd64qFm/Zope/lib/python/Products/Sessions/tests/testSessionDataManager.py", line 223, in testUnlazifyAutoPopulated
    self.app.REQUEST.traverse('/')
  File "/tmp/autotestd64qFm/Zope/lib/python/ZPublisher/BaseRequest.py", line 426, in traverse
    else: user=v(request, auth, roles)
  File "/tmp/autotestd64qFm/Zope/lib/python/AccessControl/User.py", line 647, in validate
    if self._isTop() and self.authorize(self._nobody, a,c,n,v,roles):
  File "/tmp/autotestd64qFm/Zope/lib/python/AccessControl/User.py", line 595, in authorize
    if security.validate(accessed, container, name, value, roles):
TypeError: iterable argument required

======================================================================
ERROR: testTraverse0 (Products.SiteAccess.tests.testVirtualHostMonster.VHMRegressions)
----------------------------------------------------------------------
Traceback (most recent call last):
  File "/tmp/autotestd64qFm/Zope/lib/python/Products/SiteAccess/tests/testVirtualHostMonster.py", line 77, in test
    ob = self.traverse('%s/%s/' % (vaddr, p))
  File "/tmp/autotestd64qFm/Zope/lib/python/ZPublisher/BaseRequest.py", line 426, in traverse
    else: user=v(request, auth, roles)
  File "/tmp/autotestd64qFm/Zope/lib/python/AccessControl/User.py", line 647, in validate
    if self._isTop() and self.authorize(self._nobody, a,c,n,v,roles):
  File "/tmp/autotestd64qFm/Zope/lib/python/AccessControl/User.py", line 595, in authorize
    if security.validate(accessed, container, name, value, roles):
TypeError: iterable argument required

======================================================================
ERROR: testTraverse1 (Products.SiteAccess.tests.testVirtualHostMonster.VHMRegressions)
----------------------------------------------------------------------
Traceback (most recent call last):
  File "/tmp/autotestd64qFm/Zope/lib/python/Products/SiteAccess/tests/testVirtualHostMonster.py", line 77, in test
    ob = self.traverse('%s/%s/' % (vaddr, p))
  File "/tmp/autotestd64qFm/Zope/lib/python/ZPublisher/BaseRequest.py", line 426, in traverse
    else: user=v(request, auth, roles)
  File "/tmp/autotestd64qFm/Zope/lib/python/AccessControl/User.py", line 647, in validate
    if self._isTop() and self.authorize(self._nobody, a,c,n,v,roles):
  File "/tmp/autotestd64qFm/Zope/lib/python/AccessControl/User.py", line 595, in authorize
    if security.validate(accessed, container, name, value, roles):
TypeError: iterable argument required

======================================================================
ERROR: testTraverse2 (Products.SiteAccess.tests.testVirtualHostMonster.VHMRegressions)
----------------------------------------------------------------------
Traceback (most recent call last):
  File "/tmp/autotestd64qFm/Zope/lib/python/Products/SiteAccess/tests/testVirtualHostMonster.py", line 77, in test
    ob = self.traverse('%s/%s/' % (vaddr, p))
  File "/tmp/autotestd64qFm/Zope/lib/python/ZPublisher/BaseRequest.py", line 426, in traverse
    else: user=v(request, auth, roles)
  File "/tmp/autotestd64qFm/Zope/lib/python/AccessControl/User.py", line 647, in validate
    if self._isTop() and self.authorize(self._nobody, a,c,n,v,roles):
  File "/tmp/autotestd64qFm/Zope/lib/python/AccessControl/User.py", line 595, in authorize
    if security.validate(accessed, container, name, value, roles):
TypeError: iterable argument required

======================================================================
ERROR: testTraverse3 (Products.SiteAccess.tests.testVirtualHostMonster.VHMRegressions)
----------------------------------------------------------------------
Traceback (most recent call last):
  File "/tmp/autotestd64qFm/Zope/lib/python/Products/SiteAccess/tests/testVirtualHostMonster.py", line 77, in test
    ob = self.traverse('%s/%s/' % (vaddr, p))
  File "/tmp/autotestd64qFm/Zope/lib/python/ZPublisher/BaseRequest.py", line 426, in traverse
    else: user=v(request, auth, roles)
  File "/tmp/autotestd64qFm/Zope/lib/python/AccessControl/User.py", line 647, in validate
    if self._isTop() and self.authorize(self._nobody, a,c,n,v,roles):
  File "/tmp/autotestd64qFm/Zope/lib/python/AccessControl/User.py", line 595, in authorize
    if security.validate(accessed, container, name, value, roles):
TypeError: iterable argument required

======================================================================
ERROR: testTraverse4 (Products.SiteAccess.tests.testVirtualHostMonster.VHMRegressions)
----------------------------------------------------------------------
Traceback (most recent call last):
  File "/tmp/autotestd64qFm/Zope/lib/python/Products/SiteAccess/tests/testVirtualHostMonster.py", line 77, in test
    ob = self.traverse('%s/%s/' % (vaddr, p))
  File "/tmp/autotestd64qFm/Zope/lib/python/ZPublisher/BaseRequest.py", line 426, in traverse
    else: user=v(request, auth, roles)
  File "/tmp/autotestd64qFm/Zope/lib/python/AccessControl/User.py", line 647, in validate
    if self._isTop() and self.authorize(self._nobody, a,c,n,v,roles):
  File "/tmp/autotestd64qFm/Zope/lib/python/AccessControl/User.py", line 595, in authorize
    if security.validate(accessed, container, name, value, roles):
TypeError: iterable argument required

======================================================================
ERROR: testTraverse5 (Products.SiteAccess.tests.testVirtualHostMonster.VHMRegressions)
----------------------------------------------------------------------
Traceback (most recent call last):
  File "/tmp/autotestd64qFm/Zope/lib/python/Products/SiteAccess/tests/testVirtualHostMonster.py", line 77, in test
    ob = self.traverse('%s/%s/' % (vaddr, p))
  File "/tmp/autotestd64qFm/Zope/lib/python/ZPublisher/BaseRequest.py", line 426, in traverse
    else: user=v(request, auth, roles)
  File "/tmp/autotestd64qFm/Zope/lib/python/AccessControl/User.py", line 647, in validate
    if self._isTop() and self.authorize(self._nobody, a,c,n,v,roles):
  File "/tmp/autotestd64qFm/Zope/lib/python/AccessControl/User.py", line 595, in authorize
    if security.validate(accessed, container, name, value, roles):
TypeError: iterable argument required

======================================================================
ERROR: testTraverse6 (Products.SiteAccess.tests.testVirtualHostMonster.VHMRegressions)
----------------------------------------------------------------------
Traceback (most recent call last):
  File "/tmp/autotestd64qFm/Zope/lib/python/Products/SiteAccess/tests/testVirtualHostMonster.py", line 77, in test
    ob = self.traverse('%s/%s/' % (vaddr, p))
  File "/tmp/autotestd64qFm/Zope/lib/python/ZPublisher/BaseRequest.py", line 426, in traverse
    else: user=v(request, auth, roles)
  File "/tmp/autotestd64qFm/Zope/lib/python/AccessControl/User.py", line 647, in validate
    if self._isTop() and self.authorize(self._nobody, a,c,n,v,roles):
  File "/tmp/autotestd64qFm/Zope/lib/python/AccessControl/User.py", line 595, in authorize
    if security.validate(accessed, container, name, value, roles):
TypeError: iterable argument required

======================================================================
ERROR: testTraverse7 (Products.SiteAccess.tests.testVirtualHostMonster.VHMRegressions)
----------------------------------------------------------------------
Traceback (most recent call last):
  File "/tmp/autotestd64qFm/Zope/lib/python/Products/SiteAccess/tests/testVirtualHostMonster.py", line 77, in test
    ob = self.traverse('%s/%s/' % (vaddr, p))
  File "/tmp/autotestd64qFm/Zope/lib/python/ZPublisher/BaseRequest.py", line 426, in traverse
    else: user=v(request, auth, roles)
  File "/tmp/autotestd64qFm/Zope/lib/python/AccessControl/User.py", line 647, in validate
    if self._isTop() and self.authorize(self._nobody, a,c,n,v,roles):
  File "/tmp/autotestd64qFm/Zope/lib/python/AccessControl/User.py", line 595, in authorize
    if security.validate(accessed, container, name, value, roles):
TypeError: iterable argument required

======================================================================
FAIL: testInitializeSecurityOptions (Zope.Startup.tests.testStarter.ZopeStarterTestCase)
----------------------------------------------------------------------
Traceback (most recent call last):
  File "/tmp/autotestd64qFm/Zope/lib/python/Zope/Startup/tests/testStarter.py", line 378, in testInitializeSecurityOptions
    self.assertEqual(Implementation.getImplementationName(), "PYTHON")
  File "/usr/local/lib/python2.3/unittest.py", line 302, in failUnlessEqual
    raise self.failureException, \
AssertionError: 'C' != 'PYTHON'

----------------------------------------------------------------------
Ran 2874 tests in 1958.139s

FAILED (failures=1, errors=10)



More information about the Zope-tests mailing list