[Zope-tests] FAILED (failures=1) : Zope-trunk Python-2.4.4 : Linux

Zope Unit Tests zope-tests at epy.co.at
Mon Jan 8 21:18:28 EST 2007

Zope Unit Tests : FAILED (failures=1)
Zope-trunk Python-2.4.4 : Linux

Running /usr/local/python2.4/bin/python test.py -q --all
Running unit tests:

Failure in test testAppOpensConnection (Testing.ZopeTestCase.testBaseTestCase.TestTestCase)
Traceback (most recent call last):
  File "/home/stefan/autotest/temp/python24-zope211/lib/python/Testing/ZopeTestCase/profiler.py", line 100, in __call__
  File "/home/stefan/autotest/temp/python24-zope211/lib/python/Testing/ZopeTestCase/testBaseTestCase.py", line 86, in testAppOpensConnection
    self.assertEqual(connections.count(), 1)
  File "/usr/local/python2.4/lib/python2.4/unittest.py", line 333, in failUnlessEqual
    raise self.failureException, \
AssertionError: 4 != 1

The following test left new threads behind:
testABOR (zope.server.ftp.tests.test_ftpserver.Tests)
New thread(s): [<_DummyThread(Dummy-37, started daemon)>, <_DummyThread(Dummy-36, started daemon)>]
  Ran 5977 tests with 1 failures and 0 errors in 242.969 seconds.
Running Testing.ZopeTestCase.zopedoctest.testLayerExtraction.TestLayer tests:
  Set up Testing.ZopeTestCase.zopedoctest.testLayerExtraction.TestLayer in 0.004 seconds.
  Ran 2 tests with 0 failures and 0 errors in 0.022 seconds.
Tearing down left over layers:
  Tear down Testing.ZopeTestCase.zopedoctest.testLayerExtraction.TestLayer in 0.003 seconds.
Total: 5979 tests, 1 failures, 0 errors

FAILED (failures=1)

More information about the Zope-tests mailing list